{"text_format":"3","workbook":"xlsx","n_sheets":2,"sheets":["Order form","Products"],"not_rendered":{"images":1,"macros":1,"defined_names":8},"read":"whole","date_system":"1900"}

{"sheet":"Order form","index":0,"n_rows":32,"n_cols":5,"rows_kept":32}
{"$rows_empty":7}
["Date:",{"$f":"TODAY()","v":"2018-06-02"}]
["Name:"]
["Email Address:"]
["Mailing Address:"]
[]
["City:"]
["State:"]
["Postcode:"]
["Country *"]
[null,"Product","Price","Qty","Total"]
[null,null,{"$f":"IF(B18=\"\",\"\",VLOOKUP(B18,Products!$A$2:$B$53,2,FALSE))","v":""},null,{"$f":"IF(C18=\"\",\"\",C18*D18)","v":""}]
[null,null,{"$f":"IF(B19=\"\",\"\",VLOOKUP(B19,Products!$A$2:$B$53,2,FALSE))","v":""},null,""]
[null,null,{"$f":"IF(B20=\"\",\"\",VLOOKUP(B20,Products!$A$2:$B$53,2,FALSE))","v":""},null,""]
[null,null,{"$f":"IF(B21=\"\",\"\",VLOOKUP(B21,Products!$A$2:$B$53,2,FALSE))","v":""},null,""]
[null,null,{"$f":"IF(B22=\"\",\"\",VLOOKUP(B22,Products!$A$2:$B$53,2,FALSE))","v":""},null,""]
[null,null,{"$f":"IF(B23=\"\",\"\",VLOOKUP(B23,Products!$A$2:$B$53,2,FALSE))","v":""},null,""]
[null,null,{"$f":"IF(B24=\"\",\"\",VLOOKUP(B24,Products!$A$2:$B$53,2,FALSE))","v":""},null,""]
[null,null,{"$f":"IF(B25=\"\",\"\",VLOOKUP(B25,Products!$A$2:$B$53,2,FALSE))","v":""},null,""]
[null,null,{"$f":"IF(B26=\"\",\"\",VLOOKUP(B26,Products!$A$2:$B$53,2,FALSE))","v":""},null,""]
[null,null,{"$f":"IF(B27=\"\",\"\",VLOOKUP(B27,Products!$A$2:$B$53,2,FALSE))","v":""},null,""]
[null,null,{"$f":"IF(B28=\"\",\"\",VLOOKUP(B28,Products!$A$2:$B$53,2,FALSE))","v":""},null,""]
[null,"Optional Postage Extras",null,"SUB",{"$f":"SUM(E18:E28)","v":{"v":0,"d":"$0.00"}}]
[null,null,{"$f":"IF(B30=\"\",\"\",VLOOKUP(B30,POSTXLOOK[],2,FALSE))","v":""},null,{"$f":"IF(C30=\"\",\"\",C30)","v":""}]
[{"$nulls":3},"TOTAL",{"$f":"SUM(E29:E30)","v":{"v":0,"d":"$0.00"}}]
["                     Shipping cost will be calculated once order is placed and displayed on invoice"]

{"sheet":"Products","index":1,"n_rows":53,"n_cols":17,"rows_kept":53,"hidden":true}
["Product ","Price",{"$nulls":3},"Quantity"]
["IC001-'Perenial Moon'",{"v":7.5,"d":"$7.50"},{"$nulls":3},1,{"$nulls":10},"*SELECT*"]
["IC002-'Diminutive Decline'",{"v":7.5,"d":"$7.50"},{"$nulls":3},2,{"$nulls":10},"ACT"]
["IC003-'Hindmost Prayers'",{"v":7.5,"d":"$7.50"},{"$nulls":3},3,null,"Postage Extras","Cost",{"$nulls":7},"NSW"]
["IC004-'Springtide'",{"v":7.5,"d":"$7.50"},{"$nulls":3},4,null,"None",{"v":0,"d":"$0.00"},{"$nulls":7},"NORTHERN TERRITORY"]
["IC005-'Crystalline Plume'",{"v":7.5,"d":"$7.50"},{"$nulls":3},5,null,"Priority Post",{"v":0.5,"d":"$0.50"},{"$nulls":7},"QUEENSLAND"]
["IC006-'Beauty Without Breath'",{"v":7.5,"d":"$7.50"},{"$nulls":3},6,null,"Registered Post",{"v":4,"d":"$4.00"},{"$nulls":7},"SOUTH AUSTRALIA"]
["IC007-'Details of Age'",{"v":7.5,"d":"$7.50"},{"$nulls":3},7,{"$nulls":10},"TASMANIA"]
["IC008-'Expired Grace'",{"v":7.5,"d":"$7.50"},{"$nulls":3},8,{"$nulls":10},"VICTORIA"]
["IC009-'Aqueous Divisions'",{"v":7.5,"d":"$7.50"},{"$nulls":3},9,{"$nulls":10},"WESTERN AUSTRALIA"]
["IC010-'Hindmost Prayer'",{"v":7.5,"d":"$7.50"},{"$nulls":3},10,{"$nulls":10},"INTERNATIONAL*"]
["IC011-'Barm'",{"v":7.5,"d":"$7.50"}]
["IC012-'Syncope'",{"v":7.5,"d":"$7.50"}]
["IC013-'Transition'",{"v":7.5,"d":"$7.50"}]
["IC014-'Indolent Creation'",{"v":7.5,"d":"$7.50"}]
["IC015-'Respite'",{"v":7.5,"d":"$7.50"}]
["IC016-'Fissure'",{"v":7.5,"d":"$7.50"}]
["IC017-'Subsolar Host'",{"v":7.5,"d":"$7.50"}]
["IC018-'Cross Contamination'",{"v":7.5,"d":"$7.50"}]
["IC019-'Auricular'",{"v":7.5,"d":"$7.50"}]
["IC020-'Luminous Disintegration'",{"v":7.5,"d":"$7.50"}]
["IC021-'Safe Space'",{"v":7.5,"d":"$7.50"}]
["IC022-'Fructify'",{"v":7.5,"d":"$7.50"}]
["IC023-'Solicitude'",{"v":7.5,"d":"$7.50"}]
["IC024-'Cremated Tone'",{"v":7.5,"d":"$7.50"}]
["IC025-'Incandescent Feather'",{"v":7.5,"d":"$7.50"}]
["IC026-'Exquisite Blight'",{"v":7.5,"d":"$7.50"}]
["IC027-'Slipstream'",{"v":7.5,"d":"$7.50"}]
["IC028-'Bereavement'",{"v":7.5,"d":"$7.50"}]
["IC029-'Radiant Drift'",{"v":7.5,"d":"$7.50"}]
["IC030-'Circumvolution'",{"v":7.5,"d":"$7.50"}]
["IC031-'Concealed'",{"v":7.5,"d":"$7.50"}]
["IC032-'Anthesis'",{"v":7.5,"d":"$7.50"}]
["IC033-'Perspicacity'",{"v":7.5,"d":"$7.50"}]
["IC034-'Furrowed Shore'",{"v":7.5,"d":"$7.50"}]
["IC035-'Chaparral'",{"v":7.5,"d":"$7.50"}]
["IC036-'Spectre'",{"v":7.5,"d":"$7.50"}]
["IC037-'Poised'",{"v":7.5,"d":"$7.50"}]
["IC038-'Efflorescence'",{"v":7.5,"d":"$7.50"}]
["IC039-'Cymatic Imprint'",{"v":7.5,"d":"$7.50"}]
["IC040-'Nocturnal'",{"v":7.5,"d":"$7.50"}]
["IC041-'Dead Landing'",{"v":7.5,"d":"$7.50"}]
["IC042-'Emanation'",{"v":7.5,"d":"$7.50"}]
["IC043-'Malefic Sanctum'",{"v":7.5,"d":"$7.50"}]
["IC044-'Subjacent'",{"v":7.5,"d":"$7.50"}]
["IC045-'Abayent'",{"v":7.5,"d":"$7.50"}]
["IC046-'Decomposition'",{"v":7.5,"d":"$7.50"}]
["IC047-'Power is Dead'",{"v":7.5,"d":"$7.50"}]
["IC048-'Burning Power'",{"v":7.5,"d":"$7.50"}]
["IC049-'Last Power'",{"v":7.5,"d":"$7.50"}]
["IC050-'Enigma'",{"v":7.5,"d":"$7.50"}]
["IC051-'Sub Ordnance'",{"v":7.5,"d":"$7.50"}]
["IC052-'Timberland'",{"v":7.5,"d":"$7.50"}]